HCdCl

Vibrational and/or electronic energy levels

Data compiled by: Marilyn E. Jacox

State:   ?

 Energy
 (cm-1
 Med.   Transition   λmin
 (nm)
 λmax
 (nm)

References

Tx = 33560 Ar Macrae, Green, et al., 2004

State:   X

Vib.
sym.
 No.   Approximate
 type of mode
 cm-1   Med.   Method   References

Σ+ 1 CdH stretch 1832.8 Ar IR Macrae, Green, et al., 2004
Π 2 Bend 423.7 Ar IR Macrae, Green, et al., 2004
Σ+ 3 CdCl stretch 364.5 Ar IR Macrae, Green, et al., 2004

Macrae, Green, et al., 2004
Macrae, V.A.; Green, J.C.; Greene, T.M.; Downs, A.J., Thermal and Photolytic Reactions of Group 12 Metal Atoms in HCl-Doped Argon Matrixes: Formation and Characterization of the Hydride Species HMCl (M = Zn, Cd, or Hg), J. Phys. Chem. A, 2004, 108, 44, 9500, https://doi.org/10.1021/jp040010c . [all data]