HCWH3

Vibrational and/or electronic energy levels

Data compiled by: Marilyn E. Jacox

State:   X

Vib.
sym.
 No.   Approximate
 type of mode
 cm-1   Med.   Method   References

WH2 s-stretch 1907.5 Ar IR Cho, Andrews, et al., 2005
WH stretch 1896.3 Ar IR Cho, Andrews, et al., 2005
WH stretch 1893.1 Ar IR Cho, Andrews, et al., 2005
WH stretch 1888.3 Ar IR Cho, Andrews, et al., 2005
CW stretch 1008.9 Ar IR Cho, Andrews, et al., 2005
CW stretch 1003.4 Ar IR Cho, Andrews, et al., 2005
CW stretch 995.1 Ar IR Cho, Andrews, et al., 2005
HCW bend 726.7 Ar IR Cho, Andrews, et al., 2005
WH3 s-deform. 658.0 Ar IR Cho, Andrews, et al., 2005
WH3 rock 581.9 Ar IR Cho, Andrews, et al., 2005
WH3 rock 579.4 Ar IR Cho, Andrews, et al., 2005

References

Cho, Andrews, et al., 2005
Cho, H.-G.; Andrews, L.; Marsden, C., Infrared Spectra of CH, Inorg. Chem., 2005, 44, 21, 7634, https://doi.org/10.1021/ic051090h . [all data]