HCMoH3

Vibrational and/or electronic energy levels

Data compiled by: Marilyn E. Jacox

State:   X

Vib.
sym.
 No.   Approximate
 type of mode
 cm-1   Med.   Method   References

MoH stretch 1830.0 Ar IR Cho and Andrews, 2005
CMo stretch 964.0 Ar IR Cho and Andrews, 2005
MoH2 bend 816.1 Ar IR Cho and Andrews, 2005
MoCH bend 751.2 Ar IR Cho and Andrews, 2005
MoH3 bend 580.8 Ar IR Cho and Andrews, 2005
MoH3 bend 576.2 Ar IR Cho and Andrews, 2005
MoH3 bend 571.5 Ar IR Cho and Andrews, 2005

References

Cho and Andrews, 2005
Cho, H.-G.; Andrews, L., Infrared Spectra of CH, J. Am. Chem. Soc., 2005, 127, 22, 8226, https://doi.org/10.1021/ja0511568 . [all data]