Ga3P-

Vibrational and/or electronic energy levels

Data compiled by: Marilyn E. Jacox

State:   ?

 Energy
 (cm-1
 Med.   Transition   λmin
 (nm)
 λmax
 (nm)

References

Td = 15170 ± 400 gas Taylor, Asmis, et al., 1998

Taylor, Asmis, et al., 1998
Taylor, T.R.; Asmis, K.R.; Xu, C.S.; Neumark, D.M., Evolution of Electronic Structure as a Function of Size in Gallium Phosphide Semiconductor Clusters., Chem. Phys. Lett., 1998, 297, 1-2, 133, https://doi.org/10.1016/S0009-2614(98)01104-X . [all data]