DSrD3Sr

Vibrational and/or electronic energy levels

Data compiled by: Marilyn E. Jacox

State:   X

Vib.
sym.
 No.   Approximate
 type of mode
 cm-1   Med.   Method   References

810 Ne IR Wang and Andrews, 2004
752 Ne IR Wang and Andrews, 2004
747 D2 IR Wang and Andrews, 2004
718 Ne IR Wang and Andrews, 2004
693 Ar IR Wang and Andrews, 2004
715.9 o-D2 IR Wang and Andrews, 2004
717 D2 IR Wang and Andrews, 2004
581 Ne IR Wang and Andrews, 2004
602 Ar IR Wang and Andrews, 2004
577 D2 IR Wang and Andrews, 2004
521 Ne IR Wang and Andrews, 2004

References

Wang and Andrews, 2004
Wang, X.; Andrews, L., Metal Dihydride (MH, J. Phys. Chem. A, 2004, 108, 52, 11500, https://doi.org/10.1021/jp046046m . [all data]