DHgOD

Vibrational and/or electronic energy levels

Data compiled by: Marilyn E. Jacox

State:   X

Vib.
sym.
 No.   Approximate
 type of mode
 cm-1   Med.   Method   References

a' 1 OD stretch 2690.6 D2 IR Wang and Andrews, 2005
2 HgD stretch 1519.2 Ne IR Wang and Andrews, 2005
2 HgD stretch 1519.2 Ar IR Macrae, Greene, et al., 2004
2 HgD stretch 1523.9 D2 IR Wang and Andrews, 2005
3 Mixed 646.7 Ar IR Macrae, Greene, et al., 2004
3 Mixed 652 D2 IR Wang and Andrews, 2005
4 Mixed 565.6 Ar IR Macrae, Greene, et al., 2004
4 Mixed 569.1 D2 IR Wang and Andrews, 2005

References

Wang and Andrews, 2005
Wang, X.; Andrews, L., Infrared Spectrum of Hg(OH), Inorg. Chem., 2005, 44, 1, 108, https://doi.org/10.1021/ic048673w . [all data]

Macrae, Greene, et al., 2004
Macrae, V.A.; Greene, T.M.; Downs, A.J., Matrix studies of the thermal and photolytic reactions of Zn, Cd and Hg (M) atoms with H2O: formation and characterisation of the adduct M?OH2 and photoproduct HMOHElectronic supplementary information (ESI) available: IR spectra of a matrix containing Hg and D2O (Fig. S1); calculated and observed IR spectra for M?OH2 species (M = Zn, Cd or Hg) (Table S1). See http://www.rsc.org/suppdata/cp/b4/b405300a/, Phys. Chem. Chem. Phys., 2004, 6, 19, 4586, https://doi.org/10.1039/b405300a . [all data]