DCN+2

Vibrational and/or electronic energy levels

Data compiled by: Marilyn E. Jacox

State:   X

Vib.
sym.
 No.   Approximate
 type of mode
 cm-1   Med.   Method   References

Σ+ 3 CN stretch 1090 ± 80 gas TPE Hochlaf, Pilcher-Clayton, et al., 2005

References

Hochlaf, Pilcher-Clayton, et al., 2005
Hochlaf, M.; Pilcher-Clayton, A.; Eland, J.H.D., HCN2+ dication spectroscopy: theoretical and experimental investigations, Chem. Phys., 2005, 309, 2-3, 291, https://doi.org/10.1016/j.chemphys.2004.09.026 . [all data]