DBaD3Ba

Vibrational and/or electronic energy levels

Data compiled by: Marilyn E. Jacox

State:   X

Vib.
sym.
 No.   Approximate
 type of mode
 cm-1   Med.   Method   References

626 Ne IR Wang and Andrews, 2004
627 Ar IR Wang and Andrews, 2004
620 D2 IR Wang and Andrews, 2004
535 Ar IR Wang and Andrews, 2004
560 D2 IR Wang and Andrews, 2004

References

Wang and Andrews, 2004
Wang, X.; Andrews, L., Metal Dihydride (MH, J. Phys. Chem. A, 2004, 108, 52, 11500, https://doi.org/10.1021/jp046046m . [all data]