CrCH3

Vibrational and/or electronic energy levels

Data compiled by: Marilyn E. Jacox

State:   6E

 Energy
 (cm-1
 Med.   Transition   λmin
 (nm)
 λmax
 (nm)

References

gas 6E-X 804 865 Brugh, DaBell, et al., 2004

State:   X

Vib.
sym.
 No.   Approximate
 type of mode
 cm-1   Med.   Method   References

a1 3 CrC stretch 525 ± 17 gas MPI LF Brugh, DaBell, et al., 2004

Brugh, DaBell, et al., 2004
Brugh, D.J.; DaBell, R.S.; Morse, M.D., Vibronic spectroscopy of unsaturated transition metal complexes: CrC[sub 2]H, CrCH[sub 3], and NiCH[sub 3], J. Chem. Phys., 2004, 121, 24, 12379, https://doi.org/10.1063/1.1821497 . [all data]