CH2=ZrH2

Vibrational and/or electronic energy levels

Data compiled by: Marilyn E. Jacox

State:   X

Vib.
sym.
 No.   Approximate
 type of mode
 cm-1   Med.   Method   References

ZrH2 s-stretch 1586 s Ne IR Andrews, Cho, et al., 2005
Cho, Wang, et al., 2005
ZrH2 s-stretch 1581.0 Ne IR Andrews, Cho, et al., 2005
Cho, Wang, et al., 2005
ZrH2 s-stretch 1557.8 Ar IR Cho, Wang, et al., 2005
ZrH2 s-stretch 1553.9 Ar IR Cho, Wang, et al., 2005
ZrH2 a-stretch 1551.0 Ne IR Andrews, Cho, et al., 2005
Cho, Wang, et al., 2005
ZrH2 a-stretch 1546.2 Ne IR Andrews, Cho, et al., 2005
Cho, Wang, et al., 2005
ZrH2 a-stretch 1524.8 Ar IR Cho, Wang, et al., 2005
ZrH2 a-stretch 1504.3 Ar IR Cho, Wang, et al., 2005
C=Zr stretch 757.0 Ne IR Andrews, Cho, et al., 2005
Cho, Wang, et al., 2005
C=Zr stretch 759.8 Ar IR Cho, Wang, et al., 2005
C=Zr stretch 747.1 Ar IR Cho, Wang, et al., 2005
CH2 wag 634.5 Ne IR Andrews, Cho, et al., 2005
Cho, Wang, et al., 2005
CH2 wag 652.6 Ar IR Cho, Wang, et al., 2005
CH2 wag 630.2 Ar IR Cho, Wang, et al., 2005

References

Andrews, Cho, et al., 2005
Andrews, L.; Cho, H.-G.; Wang, X., [H2C?ZrH2]: The Simplest Carbene Hydride Complex, Agostic Bonding, and C?H Activation of CH4 to Form [(CH3)2ZrH2], Angew. Chem. Int. Ed., 2005, 44, 1, 113, https://doi.org/10.1002/anie.200461526 . [all data]

Cho, Wang, et al., 2005
Cho, H.-G.; Wang, X.; Andrews, L., The C-H Activation of Methane by Laser-Ablated Zirconium Atoms: CH, J. Am. Chem. Soc., 2005, 127, 1, 465, https://doi.org/10.1021/ja0451259 . [all data]