CD3TiD

Vibrational and/or electronic energy levels

Data compiled by: Marilyn E. Jacox

State:   X

Vib.
sym.
 No.   Approximate
 type of mode
 cm-1   Med.   Method   References

TiD stretch 1111.4 Ne IR Andrews, Cho, et al., 2005
TiD stretch 1110 Ne IR Andrews, Cho, et al., 2005
TiD stretch 1093.4 Ar IR Bihlmeier, Greene, et al., 2004
Andrews, Cho, et al., 2005
TiD stretch 1092.2 Ar IR Bihlmeier, Greene, et al., 2004
Andrews, Cho, et al., 2005
TiD stretch 1088.2 Ar IR Bihlmeier, Greene, et al., 2004
Andrews, Cho, et al., 2005

References

Andrews, Cho, et al., 2005
Andrews, L.; Cho, H.-G.; Wang, X., Reactions of Methane with Titanium Atoms: CH, Inorg. Chem., 2005, 44, 13, 4834, https://doi.org/10.1021/ic0502574 . [all data]

Bihlmeier, Greene, et al., 2004
Bihlmeier, A.; Greene, T.M.; Himmel, H.-J., Toward a More Detailed Understanding of Oxidative-Addition Mechanisms: Combined Experimental and Quantum-Chemical Study of the Insertion of Titanium Atoms into C-H, Si-H, and Sn-H Bonds, Organomet., 2004, 23, 10, 2350, https://doi.org/10.1021/om040016o . [all data]