CD2=WD2

Vibrational and/or electronic energy levels

Data compiled by: Marilyn E. Jacox

State:   X

Vib.
sym.
 No.   Approximate
 type of mode
 cm-1   Med.   Method   References

WD2 stretch 1336.2 Ar IR Cho, Andrews, et al., 2005
WD2 stretch 1303.1 Ar IR Cho, Andrews, et al., 2005
Mixed 712.2 Ar IR Cho, Andrews, et al., 2005
CD2 wag 506.2 Ar IR Cho, Andrews, et al., 2005

References

Cho, Andrews, et al., 2005
Cho, H.-G.; Andrews, L.; Marsden, C., Infrared Spectra of CH, Inorg. Chem., 2005, 44, 21, 7634, https://doi.org/10.1021/ic051090h . [all data]