C6H3(CO)2O

Vibrational and/or electronic energy levels

Data compiled by: Marilyn E. Jacox

State:   X

Vib.
sym.
 No.   Approximate
 type of mode
 cm-1   Med.   Method   References

a' 1430 w Ne IR Venkataramani, Winkler, et al., 2005
1325 m Ne IR Venkataramani, Winkler, et al., 2005
1251 s Ne IR Venkataramani, Winkler, et al., 2005
1122 w m Ne IR Venkataramani, Winkler, et al., 2005
1064 w Ne IR Venkataramani, Winkler, et al., 2005
1027 w Ne IR Venkataramani, Winkler, et al., 2005
915 vs Ne IR Venkataramani, Winkler, et al., 2005
828 w Ne IR Venkataramani, Winkler, et al., 2005
672 w Ne IR Venkataramani, Winkler, et al., 2005
631 w Ne IR Venkataramani, Winkler, et al., 2005
538 w m Ne IR Venkataramani, Winkler, et al., 2005
528 Ne IR Venkataramani, Winkler, et al., 2005
a 770 w Ne IR Venkataramani, Winkler, et al., 2005
723 m Ne IR Venkataramani, Winkler, et al., 2005
637 w Ne IR Venkataramani, Winkler, et al., 2005

References

Venkataramani, Winkler, et al., 2005
Venkataramani, S.; Winkler, M.; Sander, W., 1,2,3-Tridehydrobenzene, Angew. Chem. Ind. Ed., 2005, 44, 39, 6306, https://doi.org/10.1002/anie.200501912 . [all data]