C3Cl-

Vibrational and/or electronic energy levels

Data compiled by: Marilyn E. Jacox

State:   2 1A

 Energy
 (cm-1
 Med.   Transition   λmin
 (nm)
 λmax
 (nm)

References

To = 22978 ± 10 Ne 2 1A''-X 418 435 van Wijngaarden, Shnitko, et al., 2005

Vib.
sym.
 No.   Approximate
 type of mode
 cm-1   Med.   Method   References

a' 2 945 ± 10 Ne AB van Wijngaarden, Shnitko, et al., 2005

van Wijngaarden, Shnitko, et al., 2005
van Wijngaarden, J.; Shnitko, I.; Batalov, A.; Kolek, P.; Fulara, J.; Maier, J.P., Electronic Absorption Spectra of C, J. Phys. Chem. A, 2005, 109, 25, 5553, https://doi.org/10.1021/jp051514t . [all data]