C2D3OO

Vibrational and/or electronic energy levels

Data compiled by: Marilyn E. Jacox

State:   X

Vib.
sym.
 No.   Approximate
 type of mode
 cm-1   Med.   Method   References

OO stretch 1084.0 Ar IR Yang, Yu, et al., 2005
OPLA 683.8 Ar IR Yang, Yu, et al., 2005

References

Yang, Yu, et al., 2005
Yang, R.; Yu, L.; Jin, X.; Zhou, M.; Carpenter, B.K., Reaction of vinyl radical with oxygen: A matrix isolation infrared spectroscopic and theoretical study, J. Chem. Phys., 2005, 122, 1, 014511, https://doi.org/10.1063/1.1828434 . [all data]