B(CS)2

Vibrational and/or electronic energy levels

Data compiled by: Marilyn E. Jacox

State:   X

Vib.
sym.
 No.   Approximate
 type of mode
 cm-1   Med.   Method   References

Σu+ 3 CBD a-stretch 1727.2 Ar IR Zhou, Kong, et al., 2004
4 CS a-stretch 1005.7 Ar IR Zhou, Kong, et al., 2004

References

Zhou, Kong, et al., 2004
Zhou, M.; Kong, Q.; Jin, X.; Zeng, A.; Chen, M.; Xu, Q., Infrared Spectra and Density Functional Calculations of the BCS and B(CS), J. Phys. Chem. A, 2004, 108, 50, 11014, https://doi.org/10.1021/jp045978n . [all data]