AlD3-

Vibrational and/or electronic energy levels

Data compiled by: Marilyn E. Jacox

State:   X

Vib.
sym.
 No.   Approximate
 type of mode
 cm-1   Med.   Method   References

e 3 AlD3 stretch 1250.8 T Ne IR Andrews and Wang, 2004
3 AlD3 stretch 1246.9 T D2 IR Andrews and Wang, 2004

References

Andrews and Wang, 2004
Andrews, L.; Wang, X., Infrared Spectra of Dialanes in Solid Hydrogen, J. Phys. Chem. A, 2004, 108, 19, 4202, https://doi.org/10.1021/jp037792e . [all data]