AlD2-

Vibrational and/or electronic energy levels

Data compiled by: Marilyn E. Jacox

State:   X

Vib.
sym.
 No.   Approximate
 type of mode
 cm-1   Med.   Method   References

AlD2 stretch 1056.9 Ne IR Andrews and Wang, 2004
AlD2 stretch 1048.8 o-D2 IR Andrews and Wang, 2004
AlD2 stretch 1050.0 D2 IR Andrews and Wang, 2004
AlD2 stretch 1049.3 Ne IR Andrews and Wang, 2004
AlD2 stretch 1041.8 o-D2 IR Andrews and Wang, 2004
AlD2 stretch 1043.0 D2 IR Andrews and Wang, 2004

References

Andrews and Wang, 2004
Andrews, L.; Wang, X., Infrared Spectra of Dialanes in Solid Hydrogen, J. Phys. Chem. A, 2004, 108, 19, 4202, https://doi.org/10.1021/jp037792e . [all data]