3-C6H3I

Vibrational and/or electronic energy levels

Data compiled by: Marilyn E. Jacox

State:   X

Vib.
sym.
 No.   Approximate
 type of mode
 cm-1   Med.   Method   References

a' 1840 w Ne IR Venkataramani, Winkler, et al., 2005
1443 w m Ne IR Venkataramani, Winkler, et al., 2005
1390 m Ne IR Venkataramani, Winkler, et al., 2005
1387 Ar IR Venkataramani, Winkler, et al., 2005
1163 w Ne IR Venkataramani, Winkler, et al., 2005
1078 w m Ne IR Venkataramani, Winkler, et al., 2005
1076 Ar IR Venkataramani, Winkler, et al., 2005
1013 w Ne IR Venkataramani, Winkler, et al., 2005
850 vs Ne IR Venkataramani, Winkler, et al., 2005
848 Ar IR Venkataramani, Winkler, et al., 2005
652 w m Ne IR Venkataramani, Winkler, et al., 2005
475 s Ne IR Venkataramani, Winkler, et al., 2005
473 Ar IR Venkataramani, Winkler, et al., 2005
a 760 w m Ne IR Venkataramani, Winkler, et al., 2005
754 Ar IR Venkataramani, Winkler, et al., 2005

References

Venkataramani, Winkler, et al., 2005
Venkataramani, S.; Winkler, M.; Sander, W., 1,2,3-Tridehydrobenzene, Angew. Chem. Ind. Ed., 2005, 44, 39, 6306, https://doi.org/10.1002/anie.200501912 . [all data]