t-HCOOCH2OH

Vibrational and/or electronic energy levels

Data compiled by: Marilyn E. Jacox

State:   X

Vib.
sym.
 No.   Approximate
 type of mode
 cm-1   Med.   Method   References

C=O stretch 1786 vs Ar IR Kuhne, Vaccani, et al., 1978
Hawkins, Kohlmiller, et al., 1982
COH deform. 1288 b T Ar IR Hawkins, Kohlmiller, et al., 1982
COH deform. 1278 m s T Ar IR Hawkins, Kohlmiller, et al., 1982
C-O stretch 1139 m Ar IR Hawkins, Kohlmiller, et al., 1982
C-O(H) stretch 1068 s T Ar IR Hawkins, Kohlmiller, et al., 1982
Skel. stretch 1047 s gas IR Su, Calvert, et al., 1980
Niki, Maker, et al., 1981
Skel. stretch 1042 vs T Ar IR Hawkins, Kohlmiller, et al., 1982
Skel. stretch 1035 s T Ar IR Hawkins, Kohlmiller, et al., 1982
O=C-O deform. 536 m T Ar IR Hawkins, Kohlmiller, et al., 1982
C-O-C deform. 325 m T Ar IR Hawkins, Kohlmiller, et al., 1982

Additional references: Jacox, 1994, page 423

References

Kuhne, Vaccani, et al., 1978
Kuhne, H.; Vaccani, S.; Bauder, A.; Gunthard, H.H., Linear reactor-infrared matrix and microwave spectroscopy of the gas phase ethylene ozonolysis, Chem. Phys., 1978, 28, 1-2, 11, https://doi.org/10.1016/0301-0104(78)85033-2 . [all data]

Hawkins, Kohlmiller, et al., 1982
Hawkins, M.; Kohlmiller, C.K.; Andrews, L., Matrix infrared spectra and photolysis and pyrolysis of isotopic secondary ozonides of ethylene, J. Phys. Chem., 1982, 86, 16, 3154, https://doi.org/10.1021/j100213a019 . [all data]

Su, Calvert, et al., 1980
Su, F.; Calvert, J.G.; Shaw, J.H., A FT IR spectroscopic study of the ozone-ethene reaction mechanism in oxygen-rich mixtures, J. Phys. Chem., 1980, 84, 3, 239, https://doi.org/10.1021/j100440a003 . [all data]

Niki, Maker, et al., 1981
Niki, H.; Maker, P.D.; Savage, C.M.; Breitenbach, L.P., A FT IR study of a transitory product in the gas-phase ozone-ethylene reaction, J. Phys. Chem., 1981, 85, 8, 1024, https://doi.org/10.1021/j150608a020 . [all data]

Jacox, 1994
Jacox, M.E., Vibrational and electronic energy levels of polyatomic transient molecules, American Chemical Society, Washington, DC, 1994, 464. [all data]