t-ClONO

Vibrational and/or electronic energy levels

Data compiled by: Marilyn E. Jacox

State:   X

Vib.
sym.
 No.   Approximate
 type of mode
 cm-1   Med.   Method   References

N=O stretch 1752 m s Ar IR Tevault and Smardzewski, 1977

Additional references: Jacox, 1994, page 213; Jacox, 1998, page 259; Lee, 1994

References

Tevault and Smardzewski, 1977
Tevault, D.E.; Smardzewski, R.R., Matrix reactions of chlorine atoms with NO2 molecules, J. Chem. Phys., 1977, 67, 8, 3777, https://doi.org/10.1063/1.435319 . [all data]

Jacox, 1994
Jacox, M.E., Vibrational and electronic energy levels of polyatomic transient molecules, American Chemical Society, Washington, DC, 1994, 464. [all data]

Jacox, 1998
Jacox, M.E., Vibrational and electronic energy levels of polyatomic transient molecules: supplement A, J. Phys. Chem. Ref. Data, 1998, 27, 2, 115-393, https://doi.org/10.1063/1.556017 . [all data]

Lee, 1994
Lee, T.J., Ab initio characterization of nitryl chloride (ClNO2) and chlorine nitrites (cis-ClONO, and trans-ClONO), J. Phys. Chem., 1994, 98, 1, 111, https://doi.org/10.1021/j100052a019 . [all data]