c-CH3C-OCH3

Vibrational and/or electronic energy levels

Data compiled by: Marilyn E. Jacox

State:   ?

 Energy
 (cm-1
 Med.   Transition   λmin
 (nm)
 λmax
 (nm)

References

Tx = 25600 N2 Sheridan, Moss, et al., 1988

State:   X

Vib.
sym.
 No.   Approximate
 type of mode
 cm-1   Med.   Method   References

1320 N2 IR Sheridan, Moss, et al., 1988
1275 N2 IR Sheridan, Moss, et al., 1988

Additional references: Jacox, 1994, page 415

Sheridan, Moss, et al., 1988
Sheridan, R.S.; Moss, R.A.; Wilk, B.K., et al., Direct observational studies of a singlet alkylcarbene: methylmethoxycarbene, a remarkably selective nucleophile, J. Am. Chem. Soc., 1988, 110, 22, 7563, https://doi.org/10.1021/ja00230a061 . [all data]

Jacox, 1994
Jacox, M.E., Vibrational and electronic energy levels of polyatomic transient molecules, American Chemical Society, Washington, DC, 1994, 464. [all data]