DKrC4D

Vibrational and/or electronic energy levels

Data compiled by: Marilyn E. Jacox

State:   X

Vib.
sym.
 No.   Approximate
 type of mode
 cm-1   Med.   Method   References

Σ+ 1 CD stretch 2582 Kr IR Tanskanen, Khriachtchev, et al., 2003
DKr stretch 977 Kr IR Tanskanen, Khriachtchev, et al., 2003
DKr stretch 961.5 Kr IR Tanskanen, Khriachtchev, et al., 2003
Π CCC bend 871 Kr IR Tanskanen, Khriachtchev, et al., 2003
CCC bend 869 Kr IR Tanskanen, Khriachtchev, et al., 2003

References

Tanskanen, Khriachtchev, et al., 2003
Tanskanen, H.; Khriachtchev, L.; Lundell, J.; Kiljunen, H.; Rasanen, M., Chemical Compounds Formed from Diacetylene and Rare-Gas Atoms: HKrC, J. Am. Chem. Soc., 2003, 125, 52, 16361, https://doi.org/10.1021/ja038610x . [all data]