Al2D6

Vibrational and/or electronic energy levels

Data compiled by: Marilyn E. Jacox

State:   X

Vib.
sym.
 No.   Approximate
 type of mode
 cm-1   Med.   Method   References

b1u 8 AlDt stretch 1415.8 Ne IR Wang, Andrews, et al., 2003
8 AlDt stretch 1415.0 D2 IR Andrews and Wang, 2003
Wang, Andrews, et al., 2003
Andrews and Wang, 2004
9 Deformation 607.3 Ne IR Wang, Andrews, et al., 2003
9 Deformation 607.5 D2 IR Andrews and Wang, 2003
Wang, Andrews, et al., 2003
Andrews and Wang, 2004
b2u 13 Deformation 925.3 Ne IR Wang, Andrews, et al., 2003
13 Deformation 931.6 D2 IR Andrews and Wang, 2003
Wang, Andrews, et al., 2003
Andrews and Wang, 2004
b3u 16 AlDt stretch 1396.1 Ne IR Wang, Andrews, et al., 2003
16 AlDt stretch 1402.9 D2 IR Andrews and Wang, 2003
Wang, Andrews, et al., 2003
17 AlDb stretch 1032.5 Ne IR Wang, Andrews, et al., 2003
17 AlDb stretch 1036.2 D2 IR Andrews and Wang, 2003
Wang, Andrews, et al., 2003
Andrews and Wang, 2004
18 Deformation 511.6 Ne IR Wang, Andrews, et al., 2003
18 Deformation 510.6 D2 IR Andrews and Wang, 2003
Wang, Andrews, et al., 2003
Andrews and Wang, 2004

References

Wang, Andrews, et al., 2003
Wang, X.; Andrews, L.; Tam, S.; DeRose, M.E.; Fajardo, M.E., Infrared Spectra of Aluminum Hydrides in Solid Hydrogen: Al, J. Am. Chem. Soc., 2003, 125, 30, 9218, https://doi.org/10.1021/ja0353560 . [all data]

Andrews and Wang, 2003
Andrews, L.; Wang, X., The Infrared Spectrum of Al2H6 in Solid Hydrogen, Science, 2003, 299, 5615, 2049, https://doi.org/10.1126/science.1082456 . [all data]

Andrews and Wang, 2004
Andrews, L.; Wang, X., Infrared Spectra of Dialanes in Solid Hydrogen, J. Phys. Chem. A, 2004, 108, 19, 4202, https://doi.org/10.1021/jp037792e . [all data]