Pd(D2)3

Vibrational and/or electronic energy levels

Data compiled by: Marilyn E. Jacox

State:   X

Vib.
sym.
 No.   Approximate
 type of mode
 cm-1   Med.   Method   References

DD stretch 2070 Ar IR Andrews, Wang, et al., 2001
PdD stretch 560.6 Ne IR Andrews, Wang, et al., 2001
PdD stretch 549.4 Ar IR Andrews, Wang, et al., 2001
Deformation 236.6 Ar IR Andrews, Wang, et al., 2001

References

Andrews, Wang, et al., 2001
Andrews, L.; Wang, X.; Alikhani, M.E.; Manceron, L., Observed and Calculated Infrared Spectra of Pd(H, J. Phys Chem. A, 2001, 105, 13, 3052, https://doi.org/10.1021/jp003721t . [all data]