C2D5IO2

Vibrational and/or electronic energy levels

Data compiled by: Marilyn E. Jacox

State:   X

Vib.
sym.
 No.   Approximate
 type of mode
 cm-1   Med.   Method   References

IO2 a-stretch 837.1 w m Ar IR Clark and Dann, 1996
IO2 a-stretch 829.3 m Ar IR Clark and Dann, 1996
IO2 s-stretch 802.8 w m Ar IR Clark and Dann, 1996
IO2 s-stretch 794.1 m Ar IR Clark and Dann, 1996

References

Clark and Dann, 1996
Clark, R.J.H.; Dann, J.R., Matrix Isolation Study of the Photochemically Induced Reaction between Iodoethane and Ozone Trapped in Solid Argon at 16 K. Infrared Spectra of Iodosoethane (C, J. Phys. Chem., 1996, 100, 2, 532, https://doi.org/10.1021/jp952135a . [all data]