cyc-C4D4GeD2

Vibrational and/or electronic energy levels

Data compiled by: Marilyn E. Jacox

State:   X

Vib.
sym.
 No.   Approximate
 type of mode
 cm-1   Med.   Method   References

a1 1 =CD s-stretch 2262 Ar IR Khabashesku, Boganov, et al., 1996
2 =CD a-stretch 2229 Ar IR Khabashesku, Boganov, et al., 1996
4 GeD2 s-stretch 1522 Ar IR Khabashesku, Boganov, et al., 1996
5 Mixed 1168 Ar IR Khabashesku, Boganov, et al., 1996
9 GeD2 scissor 641 Ar IR Khabashesku, Boganov, et al., 1996
b1 15 GeD2 a-stretch 1507 Ar IR Khabashesku, Boganov, et al., 1996
17 =CD wag 594 Ar IR Khabashesku, Boganov, et al., 1996
b2 24 DC-CD rock 878 Ar IR Khabashesku, Boganov, et al., 1996
25 DCGeCD scissor 707 Ar IR Khabashesku, Boganov, et al., 1996
27 GeD2 wag 486 Ar IR Khabashesku, Boganov, et al., 1996

References

Khabashesku, Boganov, et al., 1996
Khabashesku, V.N.; Boganov, S.E.; Antic, D.; Nefedov, O.M.; Michl, J., Matrix Isolation of Germacyclopentadienes: Direct Spectroscopic Evidence for Germylene-to-Germene Photochemical Interconversion, Organomet., 1996, 15, 22, 4714, https://doi.org/10.1021/om960372+ . [all data]