CD3C(=NO)CDO

Vibrational and/or electronic energy levels

Data compiled by: Marilyn E. Jacox

State:   X

Vib.
sym.
 No.   Approximate
 type of mode
 cm-1   Med.   Method   References

C=N stretch 1586.6 Ar IR Harrison and Frei, 1994

References

Harrison and Frei, 1994
Harrison, J.A.; Frei, H., J. Phys. Cnem., 1994, 98, 12142. [all data]