InC2D4

Vibrational and/or electronic energy levels

Data compiled by: Marilyn E. Jacox

State:   X

Vib.
sym.
 No.   Approximate
 type of mode
 cm-1   Med.   Method   References

CD stretch 2326 w m Ar IR Manceron and Andrews, 1990
CD stretch 2226 m Ar IR Manceron and Andrews, 1990
CD stretch 2187 w Ar IR Manceron and Andrews, 1990
CC stretch 1313.7 s Ar IR Manceron and Andrews, 1990
CD2 a-scissors 1054.5 w m Ar IR Manceron and Andrews, 1990
Mixed 944 m Ar IR Manceron and Andrews, 1990
CD2 rock 560 w Ar IR Manceron and Andrews, 1990
InC2 s-stretch 215 w Ar IR Manceron and Andrews, 1990

References

Manceron and Andrews, 1990
Manceron, L.; Andrews, L., Infrared spectrum of ethyleneindium in solid argon: normal-coordinate analysis, evaluation of the electrooptical parameters, and comparison with other metal-ethylene complexes, J. Phys. Chem., 1990, 94, 9, 3513, https://doi.org/10.1021/j100372a029 . [all data]