cyc-C7D7

Vibrational and/or electronic energy levels

Data compiled by: Marilyn E. Jacox

State:   A

Vib.
sym.
 No.   Approximate
 type of mode
 cm-1   Med.   Method   References

Ring breathing 866 ± 5 gas MPI Pino, Guthe, et al., 2002

References

Pino, Guthe, et al., 2002
Pino, T.; Guthe, F.; Ding, H.; Maier, J.P., Gas-Phase Electronic Spectrum of the Tropyl C, J. Phys. Chem. A, 2002, 106, 42, 10022, https://doi.org/10.1021/jp020910y . [all data]