CD2=CDFeOD

Vibrational and/or electronic energy levels

Data compiled by: Marilyn E. Jacox

State:   X

Vib.
sym.
 No.   Approximate
 type of mode
 cm-1   Med.   Method   References

OD stretch 2762.3 Ar IR Kafafi, Hauge, et al., 1987
C=C stretch 1484.9 Ar IR Kafafi, Hauge, et al., 1987
CD2 wag 737.6 Ar IR Kafafi, Hauge, et al., 1987
Fe-O stretch 681.5 Ar IR Kafafi, Hauge, et al., 1987
Fe-C stretch 527.9 Ar IR Kafafi, Hauge, et al., 1987

References

Kafafi, Hauge, et al., 1987
Kafafi, Z.H.; Hauge, R.H.; Billups, W.E.; Margrave, J.L., Infrared spectroscopy and photochemistry of iron-ethylene oxide in cryogenic matrixes. The FTIR spectrum of vinyliron hydroxide, J. Am. Chem. Soc., 1987, 109, 16, 4775, https://doi.org/10.1021/ja00250a003 . [all data]