CD3CNO

Vibrational and/or electronic energy levels

Data compiled by: Marilyn E. Jacox

State:   X

Vib.
sym.
 No.   Approximate
 type of mode
 cm-1   Med.   Method   References

a1 CNO a-stretch 2297 Ar IR Mielke, Hawkins, et al., 1989
CNO s-stretch 1341 Ar IR Mielke, Hawkins, et al., 1989

References

Mielke, Hawkins, et al., 1989
Mielke, Z.; Hawkins, M.; Andrews, L., Matrix reactions of oxygen atoms with methyl cyanide: infrared spectra of hydroxyacetonitrile and acetonitrile N-oxide, J. Phys. Chem., 1989, 93, 2, 558, https://doi.org/10.1021/j100339a015 . [all data]