DNiOCD3

Vibrational and/or electronic energy levels

Data compiled by: Marilyn E. Jacox

State:   X

Vib.
sym.
 No.   Approximate
 type of mode
 cm-1   Med.   Method   References

NiD stretch 1347.3 Ar IR Park, Hauge, et al., 1988
NiO stretch 546.2 Ar IR Park, Hauge, et al., 1988

References

Park, Hauge, et al., 1988
Park, M.; Hauge, R.H.; Margrave, J.L., High Temp. Sci., 1988, 25, 1. [all data]