FCD2CD2

Vibrational and/or electronic energy levels

Data compiled by: Marilyn E. Jacox

State:   X

Vib.
sym.
 No.   Approximate
 type of mode
 cm-1   Med.   Method   References

2-CD2 stretch 2090 w m Ar IR Jacox, 1981
1211 s Ar IR Jacox, 1981
1091 m Ar IR Jacox, 1981
1059 w m Ar IR Jacox, 1981
969 s Ar IR Jacox, 1981
CCF deform. 424 w Ar IR Jacox, 1981

References

Jacox, 1981
Jacox, M.E., The reaction of F atoms with C2H4. Vibrational Spectrum of the C2H4F Intermediate trapped in solid argon, Chem. Phys., 1981, 58, 3, 289, https://doi.org/10.1016/0301-0104(81)80065-1 . [all data]