SiD3ZnD

Vibrational and/or electronic energy levels

Data compiled by: Marilyn E. Jacox

State:   X

Vib.
sym.
 No.   Approximate
 type of mode
 cm-1   Med.   Method   References

ZnD stretch 1329.8 Ar IR Macrae, Greene, et al., 2004
SiD3 deform. 639.9 Ar IR Macrae, Greene, et al., 2004

References

Macrae, Greene, et al., 2004
Macrae, V.A.; Greene, T.M.; Downs, A.J., Matrix Reactivity of Zn, Cd, or Hg Atoms (M) in the Presence of Silane: Photogeneration and Characterization of the Insertion Product HMSiH, J. Phys. Chem. A, 2004, 108, 8, 1393, https://doi.org/10.1021/jp0309769 . [all data]