DAl(D)3Al

Vibrational and/or electronic energy levels

Data compiled by: Marilyn E. Jacox

State:   X

Vib.
sym.
 No.   Approximate
 type of mode
 cm-1   Med.   Method   References

696 D2 IR Wang, Andrews, et al., 2003

References

Wang, Andrews, et al., 2003
Wang, X.; Andrews, L.; Tam, S.; DeRose, M.E.; Fajardo, M.E., Infrared Spectra of Aluminum Hydrides in Solid Hydrogen: Al, J. Am. Chem. Soc., 2003, 125, 30, 9218, https://doi.org/10.1021/ja0353560 . [all data]