CD3BCl

Vibrational and/or electronic energy levels

Data compiled by: Marilyn E. Jacox

State:   X

Vib.
sym.
 No.   Approximate
 type of mode
 cm-1   Med.   Method   References

B-C stretch 1161.0 Ar IR Lanzisera and Andrews, 2000

References

Lanzisera and Andrews, 2000
Lanzisera, D.V.; Andrews, L., Reactions of Laser-Ablated Boron Atoms with Methyl Halides in Excess Argon. Infrared Spectra and Density Functional Theory Calculations on CH, J. Phys. Chem. A, 2000, 104, 41, 9295, https://doi.org/10.1021/jp0017689 . [all data]