SiD3HgD

Vibrational and/or electronic energy levels

Data compiled by: Marilyn E. Jacox

State:   X

Vib.
sym.
 No.   Approximate
 type of mode
 cm-1   Med.   Method   References

HgD stretch 1354.4 Ar IR Legay-Sommaire and Legay, 1998
Macrae, Greene, et al., 2004
HgD stretch 1338.2 Kr IR Legay-Sommaire and Legay, 1998
HgD stretch 1344.4 N2 IR Legay-Sommaire and Legay, 1998
645.9 Ar IR Legay-Sommaire and Legay, 1998
Macrae, Greene, et al., 2004
643.2 Kr IR Legay-Sommaire and Legay, 1998
646.5 N2 IR Legay-Sommaire and Legay, 1998

References

Legay-Sommaire and Legay, 1998
Legay-Sommaire, N.; Legay, F., Photochemical Insertion Reaction of Hg in SiH, J. Phys. Chem. A, 1998, 102, 45, 8759, https://doi.org/10.1021/jp9821533 . [all data]

Macrae, Greene, et al., 2004
Macrae, V.A.; Greene, T.M.; Downs, A.J., Matrix Reactivity of Zn, Cd, or Hg Atoms (M) in the Presence of Silane: Photogeneration and Characterization of the Insertion Product HMSiH, J. Phys. Chem. A, 2004, 108, 8, 1393, https://doi.org/10.1021/jp0309769 . [all data]