CD3MgBr

Vibrational and/or electronic energy levels

Data compiled by: Marilyn E. Jacox

State:   X

Vib.
sym.
 No.   Approximate
 type of mode
 cm-1   Med.   Method   References

a1 1 CD3 s-stretch 2123.5 Ar IR Bare and Andrews, 1998
2 CD3 s-deform. 881.2 Ar IR Bare and Andrews, 1998
3 CMgBr a-stretch 575 T Ar IR Bare and Andrews, 1998
e 5 CD3 a-stretch 2138.5 Ar IR Bare and Andrews, 1998
7 CD3 rock 429.0 Ar IR Bare and Andrews, 1998

References

Bare and Andrews, 1998
Bare, W.D.; Andrews, L., Formation of Grignard Species from the Reaction of Methyl Halides with Laser-Ablated Magnesium Atoms. A Matrix Infrared Study of CH, J. Am. Chem. Soc., 1998, 120, 29, 7293, https://doi.org/10.1021/ja980806n . [all data]