D2BCCD

Vibrational and/or electronic energy levels

Data compiled by: Marilyn E. Jacox

State:   X

Vib.
sym.
 No.   Approximate
 type of mode
 cm-1   Med.   Method   References

a1 1832.5 Ar IR Andrews, Lanzisera, et al., 1998
b2 9 BD2 a-stretch 1945.9 Ar IR Andrews, Lanzisera, et al., 1998

References

Andrews, Lanzisera, et al., 1998
Andrews, L.; Lanzisera, D.V.; Hassanzadeh, P.; Hannachi, Y., Reactions of Laser-Ablated Boron Atoms with Ethylene and Ethane. Infrared Spectra and DFT Calculations for Several Novel BC, J. Phys. Chem. A, 1998, 102, 19, 3259, https://doi.org/10.1021/jp980437h . [all data]