CD3CoD

Vibrational and/or electronic energy levels

Data compiled by: Marilyn E. Jacox

State:   X

Vib.
sym.
 No.   Approximate
 type of mode
 cm-1   Med.   Method   References

CoD stretch 1241.0 Ar IR Billups, Chang, et al., 1993

References

Billups, Chang, et al., 1993
Billups, W.E.; Chang, S.-C.; Hauge, R.H.; Margrave, J.L., Detection of a .sigma.-complex in the reaction of cobalt atoms with methane, J. Am. Chem. Soc., 1993, 115, 5, 2039, https://doi.org/10.1021/ja00058a062 . [all data]