D2CBD2

Vibrational and/or electronic energy levels

Data compiled by: Marilyn E. Jacox

State:   X

Vib.
sym.
 No.   Approximate
 type of mode
 cm-1   Med.   Method   References

a1 BD2 scissors 1177 Ar IR Hassanzadeh, Hannachi, et al., 1993
b1 BD2 OPLA 794.8 Ar IR Hassanzadeh, Hannachi, et al., 1993
b2 BD2 a-stretch 1923 Ar IR Hassanzadeh, Hannachi, et al., 1993

References

Hassanzadeh, Hannachi, et al., 1993
Hassanzadeh, P.; Hannachi, Y.; Andrews, L., Pulsed laser evaporated boron atom reactions with methane. 2. Infrared spectra of H2CBH2, H2CBH, HCBH, and HBCBH in solid argon, J. Phys. Chem., 1993, 97, 24, 6418, https://doi.org/10.1021/j100126a016 . [all data]