DBeD2BeD

Vibrational and/or electronic energy levels

Data compiled by: Marilyn E. Jacox

State:   X

Vib.
sym.
 No.   Approximate
 type of mode
 cm-1   Med.   Method   References

b1u BeD(t) stretch 1536 Ne IR Wang and Andrews, 2005
br-BeD stretch 1098.5 Ne IR Wang and Andrews, 2005
br-BeD stretch 1098.2 D2 IR Wang and Andrews, 2005
b2u br-BeD stretch 1232.9 Ne IR Wang and Andrews, 2005
br-BeD stretch 1232.0 D2 IR Wang and Andrews, 2005
b3u Deformation 685.4 Ne IR Wang and Andrews, 2005
Deformation 685 D2 IR Wang and Andrews, 2005

References

Wang and Andrews, 2005
Wang, X.; Andrews, L., One-Dimensional BeH, Inorg. Chem., 2005, 44, 3, 610, https://doi.org/10.1021/ic048464b . [all data]