CD3GaD

Vibrational and/or electronic energy levels

Data compiled by: Marilyn E. Jacox

State:   X

Vib.
sym.
 No.   Approximate
 type of mode
 cm-1   Med.   Method   References

CD stretch 2223.9 Ar IR Lafleur and Parnis, 1992
Himmel, Downs, et al., 2000
CD stretch 2137 Ar IR Lafleur and Parnis, 1992
GaD stretch 1243.6 Ar IR Lafleur and Parnis, 1992
Xiao, Hauge, et al., 1993
Himmel, Downs, et al., 2000
GaD stretch 1239.0 Kr IR Xiao, Hauge, et al., 1993
CD3 deform. 1026 Ar IR Lafleur and Parnis, 1992
CD3 deform. 747.0 T Kr IR Xiao, Hauge, et al., 1993
CD3 rock 578.2 Ar IR Lafleur and Parnis, 1992
Xiao, Hauge, et al., 1993
Himmel, Downs, et al., 2000
GaC stretch 525.0 T Ar IR Xiao, Hauge, et al., 1993

References

Lafleur and Parnis, 1992
Lafleur, R.D.; Parnis, J.M., Chemical quenching of excited-state gallium (2S) atoms by methane in argon matrixes, J. Phys. Chem., 1992, 96, 6, 2429, https://doi.org/10.1021/j100185a009 . [all data]

Himmel, Downs, et al., 2000
Himmel, H.-J.; Downs, A.J.; Greene, T.M.; Andrews, L., Matrix Photochemistry of Gallium and Indium Atoms (M) in the Presence of Methane: Formation and Characterization of the Divalent Species CH, Organomet., 2000, 19, 6, 1060, https://doi.org/10.1021/om990905p . [all data]

Xiao, Hauge, et al., 1993
Xiao, Z.L.; Hauge, R.H.; Margrave, J.L., Cryogenic reactions of gallium with molecular hydrogen and methane, Inorg. Chem., 1993, 32, 5, 642, https://doi.org/10.1021/ic00057a026 . [all data]