SiD3AlD

Vibrational and/or electronic energy levels

Data compiled by: Marilyn E. Jacox

State:   X

Vib.
sym.
 No.   Approximate
 type of mode
 cm-1   Med.   Method   References

a' 1 SiD stretch 1572.9 Ar IR Gaertner, Himmel, et al., 2004
2 SiD stretch 1520.3 w Ar IR Lefcourt and Ozin, 1991
Gaertner, Himmel, et al., 2004
a' 3 AlD stretch 1297.8 w m Ar IR Lefcourt and Ozin, 1991
Gaertner and Himmel, 2002
Gaertner, Himmel, et al., 2004
5 SiD3 deform. 630.8 m Ar IR Lefcourt and Ozin, 1991
Gaertner and Himmel, 2002
Gaertner, Himmel, et al., 2004
a 9 SiD stretch 1543.7 Ar IR Gaertner and Himmel, 2002
Gaertner, Himmel, et al., 2004

References

Gaertner, Himmel, et al., 2004
Gaertner, B.; Himmel, H.-J.; Macrae, V.A.; Downs, A.J.; Greene, T.M., Matrix Reactivity of Al and Ga Atoms (M) in the Presence of Silane: Generation and Characterization of theη2-Coordinated Complex M•SiH4, the Insertion Product HMSiH3, and the MI Species MSiH3 in a Solid Argon Matrix, Chem. Eur. J., 2004, 10, 14, 3430, https://doi.org/10.1002/chem.200305493 . [all data]

Lefcourt and Ozin, 1991
Lefcourt, M.A.; Ozin, G.A., Aluminum(2P)-silane complex and photoreversible oxidative addition/reductive elimination reaction Al(2P) missing citation .tautm. SiH3AlH. 2. Al(2P) missing citation .tautm. SiH3AlH reaction, J. Phys. Chem., 1991, 95, 7, 2623, https://doi.org/10.1021/j100160a003 . [all data]

Gaertner and Himmel, 2002
Gaertner, B.; Himmel, H.-J., Characterization and Photochemistry of the Silane-Aluminum Complex Al•SiH, Angew. Chem. Int. Ed., 2002, 41, 9, 1538, https://doi.org/10.1002/1521-3773(20020503)41:9<1538::AID-ANIE1538>3.0.CO;2-K . [all data]