D2NNCO

Vibrational and/or electronic energy levels

Data compiled by: Marilyn E. Jacox

State:   X

Vib.
sym.
 No.   Approximate
 type of mode
 cm-1   Med.   Method   References

NCO a-stretch 2260 vs Ar IR Teles and Maier, 1989
2213 vs Ar IR Teles and Maier, 1989
ND2 scissors 1181 w Ar IR Teles and Maier, 1989
876 w Ar IR Teles and Maier, 1989
790 w Ar IR Teles and Maier, 1989
NN stretch 843 w Ar IR Teles and Maier, 1989
NNC deform. 638 w Ar IR Teles and Maier, 1989
NCO deform. 563 w Ar IR Teles and Maier, 1989

References

Teles and Maier, 1989
Teles, J.H.; Maier, G., Methoxy- and Aminoisocyanate, Chem. Ber., 1989, 122, 4, 745, https://doi.org/10.1002/cber.19891220423 . [all data]