CD3BrF

Vibrational and/or electronic energy levels

Data compiled by: Marilyn E. Jacox

State:   X

Vib.
sym.
 No.   Approximate
 type of mode
 cm-1   Med.   Method   References

BrF stretch 536 vs Ar IR Jacox, 1985

References

Jacox, 1985
Jacox, M.E., Reaction of F atoms with the methyl halides. Vibrational spectra of CH3XF and of H2CX•••HF trapped in solid argon, J. Chem. Phys., 1985, 83, 7, 3255, https://doi.org/10.1063/1.449184 . [all data]