CD3OI

Vibrational and/or electronic energy levels

Data compiled by: Marilyn E. Jacox

State:   X

Vib.
sym.
 No.   Approximate
 type of mode
 cm-1   Med.   Method   References

OI stretch 509 Ar IR Hawkins and Andrews, 1985

References

Hawkins and Andrews, 1985
Hawkins, M.; Andrews, L., Photochemistry of an ozone complex with iodomethane in solid argon at 17 K. Infrared spectra of iodosomethane (CH3IO) and the hydrogen-bonded CH2O--HI complex, Inorg. Chem., 1985, 24, 20, 3285, https://doi.org/10.1021/ic00214a038 . [all data]