CD3IO

Vibrational and/or electronic energy levels

Data compiled by: Marilyn E. Jacox

State:   X

Vib.
sym.
 No.   Approximate
 type of mode
 cm-1   Med.   Method   References

CD3 s-stretch 2132 Ar IR Hawkins and Andrews, 1985
CD3 deform. 939 Ar IR Hawkins and Andrews, 1985
IO stretch 723 Ar IR Hawkins and Andrews, 1985
CD3 rock 646 Ar IR Hawkins and Andrews, 1985
CD3 rock 640 Ar IR Hawkins and Andrews, 1985
CI stretch 460 Ar IR Hawkins and Andrews, 1985

References

Hawkins and Andrews, 1985
Hawkins, M.; Andrews, L., Photochemistry of an ozone complex with iodomethane in solid argon at 17 K. Infrared spectra of iodosomethane (CH3IO) and the hydrogen-bonded CH2O--HI complex, Inorg. Chem., 1985, 24, 20, 3285, https://doi.org/10.1021/ic00214a038 . [all data]