D2OOO+

Vibrational and/or electronic energy levels

Data compiled by: Marilyn E. Jacox

State:   X

Vib.
sym.
 No.   Approximate
 type of mode
 cm-1   Med.   Method   References

a' 1 OD spstretch 2449.6 Ar IR Zhou, Zeng, et al., 2003
2 O-O stretch 1601.1 Ar IR Zhou, Zeng, et al., 2003
D2O-O stretch 606.3 Ar IR Zhou, Zeng, et al., 2003
a OD a-stretch 2555.5 Ar IR Zhou, Zeng, et al., 2003

References

Zhou, Zeng, et al., 2003
Zhou, M.; Zeng, A.; Wang, Y.; Kong, Q.; Wang, Z.-X.; Schleyer, P. vanR., Experimental and Theoretical Characterization of H, J. Am. Chem. Soc., 2003, 125, 38, 11512, https://doi.org/10.1021/ja037125z . [all data]